[Ipopt] Ipopt : make test fail

Ouzia h.ouzia at gmail.com
Thu Sep 3 09:25:04 EDT 2009


I'm trying to build (on MAC OS X 10.5) the last ipopt stable version  
(3.7). The "make test " step  ended up with the error below.

Thanks for help.


mit-frame-pointer -pipe     -o hs071_f  hs071_f.o ../src/Interfaces/ 
libipopt.la -llapack -lblas -lm  -ldl -lstdc++ -lm -ldl
gfortran -I../../../Ipopt/test/../src/Interfaces -O3 -fomit-frame- 
pointer -pipe -o .libs/hs071_f hs071_f.o  ../src/Interfaces/.libs/ 
libipopt.dylib -llapack -lblas -lstdc++ -lm -ldl
ld: library not found for -lstdc++
collect2: ld returned 1 exit status
make[2]: *** [hs071_f] Error 1
make[1]: *** [unitTest] Error 2
make: *** [test] Error 2

M. Hacene Ouzia

More information about the Ipopt mailing list